Target
C-terminal-binding protein 2
Ligand
BDBM50167972
Substrate
Meas. Tech.
ChEMBL_1574551 (CHEMBL3804623)
IC50
2160±n/a nM
Citation
 Korwar, SMorris, BLParikh, HICoover, RADoughty, TWLove, IMHilbert, BJRoyer, WEKellogg, GEGrossman, SREllis, KC Design, synthesis, and biological evaluation of substrate-competitive inhibitors of C-terminal Binding Protein (CtBP). Bioorg Med Chem 24:2707-15 (2016)  
Target
Name:
C-terminal-binding protein 2
Synonyms:
C-terminal-binding protein 2 CTBP2 | CTBP2_HUMAN
Type:
Protein
Mol. Mass.:
48948.33
Organism:
Homo sapiens (Human)
Description:
P56545
Residue:
445
  
Inhibitor
Name:
BDBM50167972
Synonyms:
CHEMBL3800334
Type:
Small organic molecule
Emp. Form.:
C10H11NO4
Mol. Mass.:
209.1986
SMILES:
COc1ccc(C\C(=N\O)C(O)=O)cc1
: