Target
C-terminal-binding protein 2
Ligand
BDBM50167976
Substrate
Meas. Tech.
ChEMBL_1574551 (CHEMBL3804623)
IC50
170±n/a nM
Citation
 Korwar, SMorris, BLParikh, HICoover, RADoughty, TWLove, IMHilbert, BJRoyer, WEKellogg, GEGrossman, SREllis, KC Design, synthesis, and biological evaluation of substrate-competitive inhibitors of C-terminal Binding Protein (CtBP). Bioorg Med Chem 24:2707-15 (2016)  
Target
Name:
C-terminal-binding protein 2
Synonyms:
C-terminal-binding protein 2 CTBP2 | CTBP2_HUMAN
Type:
Protein
Mol. Mass.:
48948.33
Organism:
Homo sapiens (Human)
Description:
P56545
Residue:
445
  
Inhibitor
Name:
BDBM50167976
Synonyms:
CHEMBL3799940
Type:
Small organic molecule
Emp. Form.:
C9H8ClNO3
Mol. Mass.:
213.618
SMILES:
O\N=C(\Cc1cccc(Cl)c1)C(O)=O
: