Target
Kappa-type opioid receptor
Ligand
BDBM50168139
Substrate
Meas. Tech.
ChEBML_1575963
Ki
6470±n/a nM
Citation
 Pasquinucci, LTurnaturi, RAricò, GParenti, CPallaki, PGeorgoussi, ZRonsisvalle, S Evaluation of N-substituent structural variations in opioid receptor profile of LP1. Bioorg Med Chem 24:2832-42 (2016)  
Target
Name:
Kappa-type opioid receptor
Synonyms:
K-OR-1 Kappa-opioid receptor (KOR) Kappa-type opioid receptor (KOR) OPIATE Kappa OPRK1 kappa opioid receptor (KOR)
Type:
G Protein-Coupled Receptor (GPCR)
Mol. Mass.:
42648.76
Organism:
Homo sapiens (Human)
Description:
P41145
Residue:
380
  
Inhibitor
Name:
BDBM50168139
Synonyms:
CHEMBL3800620
Type:
Small organic molecule
Emp. Form.:
C26H29N3O2
Mol. Mass.:
415.5274
SMILES:
[H][C@]12Cc3ccc(O)cc3[C@](C)(CCN1CCC(=O)Nc1cnc3ccccc3c1)[C@H]2C
: