Target
Mu-type opioid receptor
Ligand
BDBM50168141
Substrate
Meas. Tech.
ChEBML_1575957
EC50
50118723±n/a nM
Citation
 Pasquinucci, LTurnaturi, RAricò, GParenti, CPallaki, PGeorgoussi, ZRonsisvalle, S Evaluation of N-substituent structural variations in opioid receptor profile of LP1. Bioorg Med Chem 24:2832-42 (2016)  
Target
Name:
Mu-type opioid receptor
Synonyms:
M-OR-1 Mu opioid receptor OPIATE Mu OPRM_CAVPO
Type:
Enzyme Catalytic Domain
Mol. Mass.:
11165.58
Organism:
GUINEA PIG
Description:
P97266
Residue:
98
  
Inhibitor
Name:
BDBM50168141
Synonyms:
CHEMBL3797228
Type:
Small organic molecule
Emp. Form.:
C27H30N2O2
Mol. Mass.:
414.5393
SMILES:
[H][C@]12Cc3ccc(O)cc3[C@](C)(CCN1CCC(=O)Nc1cccc3ccccc13)[C@H]2C
: