Target
Kappa-type opioid receptor
Ligand
BDBM50000296
Substrate
Meas. Tech.
ChEMBL_1575962 (CHEMBL3802791)
EC50
631±n/a nM
Citation
 Pasquinucci, LTurnaturi, RAricò, GParenti, CPallaki, PGeorgoussi, ZRonsisvalle, S Evaluation of N-substituent structural variations in opioid receptor profile of LP1. Bioorg Med Chem 24:2832-42 (2016)  
Target
Name:
Kappa-type opioid receptor
Synonyms:
K-OR-1 Kappa-opioid receptor (KOR) Kappa-type opioid receptor (KOR) OPIATE Kappa OPRK1 kappa opioid receptor (KOR)
Type:
G Protein-Coupled Receptor (GPCR)
Mol. Mass.:
42648.76
Organism:
Homo sapiens (Human)
Description:
P41145
Residue:
380
  
Inhibitor
Name:
BDBM50000296
Synonyms:
CHEMBL441765 U-50488H | US11492374, ID 1
Type:
Small organic molecule
Emp. Form.:
C19H26Cl2N2O
Mol. Mass.:
369.329
SMILES:
CN([C@@H]1CCCC[C@H]1N1CCCC1)C(=O)Cc1ccc(Cl)c(Cl)c1
: