Target
Delta-type opioid receptor
Ligand
BDBM50168141
Substrate
Meas. Tech.
ChEBML_1575959
EC50
7943±n/a nM
Citation
 Pasquinucci, LTurnaturi, RAricò, GParenti, CPallaki, PGeorgoussi, ZRonsisvalle, S Evaluation of N-substituent structural variations in opioid receptor profile of LP1. Bioorg Med Chem 24:2832-42 (2016)  
Target
Name:
Delta-type opioid receptor
Synonyms:
DOR-1 MSL-2 OPRD_MOUSE Oprd1
Type:
Enzyme Catalytic Domain
Mol. Mass.:
40577.25
Organism:
MOUSE
Description:
P32300
Residue:
372
  
Inhibitor
Name:
BDBM50168141
Synonyms:
CHEMBL3797228
Type:
Small organic molecule
Emp. Form.:
C27H30N2O2
Mol. Mass.:
414.5393
SMILES:
[H][C@]12Cc3ccc(O)cc3[C@](C)(CCN1CCC(=O)Nc1cccc3ccccc13)[C@H]2C
: