Target
Mu-type opioid receptor
Ligand
BDBM50142692
Substrate
Meas. Tech.
ChEBML_1575957
EC50
794±n/a nM
Citation
 Pasquinucci, LTurnaturi, RAricò, GParenti, CPallaki, PGeorgoussi, ZRonsisvalle, S Evaluation of N-substituent structural variations in opioid receptor profile of LP1. Bioorg Med Chem 24:2832-42 (2016)  
Target
Name:
Mu-type opioid receptor
Synonyms:
M-OR-1 Mu opioid receptor OPIATE Mu OPRM_CAVPO
Type:
Enzyme Catalytic Domain
Mol. Mass.:
11165.58
Organism:
GUINEA PIG
Description:
P97266
Residue:
98
  
Inhibitor
Name:
BDBM50142692
Synonyms:
CHEMBL3759092
Type:
Small organic molecule
Emp. Form.:
C23H28N2O2
Mol. Mass.:
364.4806
SMILES:
[H][C@]12Cc3ccc(O)cc3[C@](C)(CCN1CCC(=O)Nc1ccccc1)[C@H]2C
: