Target
Phosphatidylinositol 4,5-bisphosphate 3-kinase catalytic subunit delta isoform
Ligand
BDBM50168434
Substrate
Meas. Tech.
ChEMBL_1577421 (CHEMBL3806632)
EC50
1.000000±n/a nM
Citation
 Patel, LChandrasekhar, JEvarts, JHaran, ACIp, CKaplan, JAKim, MKoditek, DLad, LLepist, EIMcGrath, MENovikov, NPerreault, SPuri, KDSomoza, JRSteiner, BHStevens, KLTherrien, JTreiberg, JVillaseņor, AGYeung, APhillips, G 2,4,6-Triaminopyrimidine as a Novel Hinge Binder in a Series of PI3Kd Selective Inhibitors. J Med Chem 59:3532-48 (2016)  
Target
Name:
Phosphatidylinositol 4,5-bisphosphate 3-kinase catalytic subunit delta isoform
Synonyms:
PI3-kinase p110 subunit delta PI3-kinase subunit p110-delta PIK3CD Phosphatidylinositol 4,5-biphosphate 3-kinase catalytic subunit delta (PIK3CD) Phosphatidylinositol 4,5-bisphosphate 3-kinase 110 kDa catalytic subunit delta (PI3K delta) Phosphatidylinositol 4,5-bisphosphate 3-kinase catalytic subunit delta (PI3Kdelta) Phosphatidylinositol 4,5-bisphosphate 3-kinase catalytic subunit delta isoform (PI3K delta) Phosphatidylinositol 4,5-bisphosphate 3-kinase catalytic subunit delta isoform (PI3K-delta) Phosphatidylinositol 4,5-bisphosphate 3-kinase catalytic subunit delta isoform (PI3Kdelta)
Type:
Enzyme Subunit
Mol. Mass.:
119489.41
Organism:
Homo sapiens (Human)
Description:
O00329
Residue:
1044
  
Inhibitor
Name:
BDBM50168434
Synonyms:
CHEMBL3805738
Type:
Small organic molecule
Emp. Form.:
C21H15F3N8O
Mol. Mass.:
452.392
SMILES:
C[C@H](Nc1nc(N)nc(N)c1C#N)c1nc2cccc(F)c2c(=O)n1-c1cc(F)cc(F)c1
: