Target
NAD-dependent protein deacetylase sirtuin-3, mitochondrial
Ligand
BDBM50168834
Substrate
Meas. Tech.
ChEMBL_1577533 (CHEMBL3806942)
IC50
4080±n/a nM
Citation
 Ai, TWilson, DJMore, SSXie, JChen, L 5-((3-Amidobenzyl)oxy)nicotinamides as Sirtuin 2 Inhibitors. J Med Chem 59:2928-41 (2016)  
Target
Name:
NAD-dependent protein deacetylase sirtuin-3, mitochondrial
Synonyms:
NAD-dependent deacetylase sirtuin 3 SIR2L3 SIRT3
Type:
Protein
Mol. Mass.:
43582.69
Organism:
Homo sapiens (Human)
Description:
Q9NTG7
Residue:
399
  
Inhibitor
Name:
BDBM50168834
Synonyms:
CHEMBL3806221
Type:
Small organic molecule
Emp. Form.:
C22H21N3O3
Mol. Mass.:
375.4204
SMILES:
NC(=O)c1cncc(OCc2cccc(NC(=O)CCc3ccccc3)c2)c1
: