Target
Cytochrome P450 1A2
Ligand
BDBM50236897
Substrate
Meas. Tech.
ChEMBL_1578175 (CHEMBL3807257)
IC50
1400±n/a nM
Citation
 Billamboz, MSuchaud, VBailly, FLion, CAndréola, MLChrist, FDebyser, ZCotelle, P 2-hydroxyisoquinoline-1,3(2H,4H)-diones (HIDs) as human immunodeficiency virus type 1 integrase inhibitors: Influence of the alkylcarboxamide substitution of position 4. Eur J Med Chem 117:256-68 (2016)  
Target
Name:
Cytochrome P450 1A2
Synonyms:
CP1A2_HUMAN CYPIA2 Cytochrome P(3)450 Cytochrome P450 1A2 (CYP1A2) Cytochrome P450-P3
Type:
Enzyme
Mol. Mass.:
58423.38
Organism:
Homo sapiens (Human)
Description:
P05177
Residue:
516
  
Inhibitor
Name:
BDBM50236897
Synonyms:
3-(furan-2-ylmethyl)-1,8-dimethyl-1H-purine-2,6(3H,7H)-dione US9180183, Furafylline | furafylline
Type:
Small organic molecule
Emp. Form.:
C12H12N4O3
Mol. Mass.:
260.2487
SMILES:
Cc1nc2n(Cc3ccco3)c(=O)n(C)c(=O)c2[nH]1
: