Target
5-hydroxytryptamine receptor 1A
Ligand
BDBM50171405
Substrate
Meas. Tech.
ChEMBL_1576958 (CHEMBL3806801)
EC50
12±n/a nM
Citation
 Yang, FJiang, XLi, JWang, YLiu, YBi, MWu, CZhao, QChen, WYin, JZhang, JXie, YHu, TXu, MGuo, SWang, ZHe, YShen, J Synthesis, structure-activity relationships, and biological evaluation of a series of benzamides as potential multireceptor antipsychotics. Bioorg Med Chem Lett 26:3141-7 (2016)  
Target
Name:
5-hydroxytryptamine receptor 1A
Synonyms:
5-HT-1A 5-hydroxytryptamine receptor 1A (5-HT-1A) ADRB2RL1 Dopamine D2 receptor and serotonin 1a receptor HTR1A | Serotonin receptor 1A
Type:
Mol. Mass.:
46122.49
Organism:
Homo sapiens (Human)
Description:
Residue:
422
  
Inhibitor
Name:
BDBM50171405
Synonyms:
CHEMBL3805165
Type:
Small organic molecule
Emp. Form.:
C23H27F2N3O4
Mol. Mass.:
447.475
SMILES:
CNC(=O)c1cccc(OCCCCN2CCN(CC2)c2cccc3OC(F)(F)Oc23)c1
: