Target
5-hydroxytryptamine receptor 2A
Ligand
BDBM50171405
Substrate
Meas. Tech.
ChEMBL_1576959 (CHEMBL3806802)
IC50
>10000±n/a nM
Citation
 Yang, FJiang, XLi, JWang, YLiu, YBi, MWu, CZhao, QChen, WYin, JZhang, JXie, YHu, TXu, MGuo, SWang, ZHe, YShen, J Synthesis, structure-activity relationships, and biological evaluation of a series of benzamides as potential multireceptor antipsychotics. Bioorg Med Chem Lett 26:3141-7 (2016)  
Target
Name:
5-hydroxytryptamine receptor 2A
Synonyms:
5-HT-2 5-HT2A 5-hydroxytryptamine receptor 2A (5HT-2A) 5HT2A_HUMAN HTR2A | Serotonin receptor 2A
Type:
undefined
Mol. Mass.:
52607.65
Organism:
Homo sapiens (Human)
Description:
P28223
Residue:
471
  
Inhibitor
Name:
BDBM50171405
Synonyms:
CHEMBL3805165
Type:
Small organic molecule
Emp. Form.:
C23H27F2N3O4
Mol. Mass.:
447.475
SMILES:
CNC(=O)c1cccc(OCCCCN2CCN(CC2)c2cccc3OC(F)(F)Oc23)c1
: