Target
Cysteinyl leukotriene receptor 1
Ligand
BDBM50172335
Substrate
Meas. Tech.
ChEBML_1579540
IC50
5.9±n/a nM
Citation
 Chen, HYang, HWang, ZXie, XNan, F Discovery of 3-Substituted 1H-Indole-2-carboxylic Acid Derivatives as a Novel Class of CysLT1 Selective Antagonists. ACS Med Chem Lett 7:335-9 (2016)  
Target
Name:
Cysteinyl leukotriene receptor 1
Synonyms:
CLTR1_HUMAN CYSLTR1 Cysteinyl leukotriene receptor HG55 LTD4 receptor | Leukotriene Cysteinyl 1
Type:
Enzyme Catalytic Domain
Mol. Mass.:
38565.16
Organism:
Homo sapiens (Human)
Description:
Leukotriene Cysteinyl 1 CYSLTR1 HUMAN::Q9Y271
Residue:
337
  
Inhibitor
Name:
BDBM50172335
Synonyms:
CHEMBL3810210
Type:
Small organic molecule
Emp. Form.:
C30H22ClN3O4
Mol. Mass.:
523.966
SMILES:
COc1cccc2c(\C=C\C(=O)Nc3cccc(\C=C\c4ccc5ccc(Cl)cc5n4)c3)c([nH]c12)C(O)=O
: