Target
Cysteinyl leukotriene receptor 2
Ligand
BDBM50172339
Substrate
Meas. Tech.
ChEMBL_1579541 (CHEMBL3810887)
IC50
46000±n/a nM
Citation
 Chen, HYang, HWang, ZXie, XNan, F Discovery of 3-Substituted 1H-Indole-2-carboxylic Acid Derivatives as a Novel Class of CysLT1 Selective Antagonists. ACS Med Chem Lett 7:335-9 (2016)  
Target
Name:
Cysteinyl leukotriene receptor 2
Synonyms:
CLTR2_HUMAN CYSLT2R Cysteinyl leukotriene receptor Leukotriene Cysteinyl 2
Type:
Enzyme Catalytic Domain
Mol. Mass.:
39657.52
Organism:
Homo sapiens (Human)
Description:
Leukotriene Cysteinyl 2 CYSLTR2 HUMAN::Q9NS75
Residue:
346
  
Inhibitor
Name:
BDBM50172339
Synonyms:
CHEMBL3809189
Type:
Small organic molecule
Emp. Form.:
C29H19ClFN3O3
Mol. Mass.:
511.931
SMILES:
OC(=O)c1[nH]c2ccc(F)cc2c1\C=C\C(=O)Nc1cccc(\C=C\c2ccc3ccc(Cl)cc3n2)c1
: