Target
DNA topoisomerase 4 subunit B
Ligand
BDBM50173879
Substrate
Meas. Tech.
ChEMBL_1580966 (CHEMBL3812634)
IC50
183±n/a nM
Citation
 Cross, JBZhang, JYang, QMesleh, MFRomero, JAWang, BBevan, DPoutsiaka, KMEpie, FMoy, TDaniel, AShotwell, JChamberlain, BCarter, NAndersen, OBarker, JRyan, MDMetcalf, CASilverman, JNguyen, KLippa, BDolle, RE Discovery of Pyrazolopyridones as a Novel Class of Gyrase B Inhibitors Using Structure Guided Design. ACS Med Chem Lett 7:374-8 (2016)  
Target
Name:
DNA topoisomerase 4 subunit B
Synonyms:
DNA topoisomerase 4 subunit B PARE_STAA8 grlB | parE
Type:
Enzyme
Mol. Mass.:
74365.92
Organism:
Staphylococcus aureus
Description:
Q2FYS5
Residue:
663
  
Inhibitor
Name:
BDBM50173879
Synonyms:
CHEMBL3810359
Type:
Small organic molecule
Emp. Form.:
C17H15N5OS
Mol. Mass.:
337.399
SMILES:
CCCn1c2[nH]nc(-c3cnc(s3)-c3cccnc3)c2ccc1=O
: