Target
Branched-chain-amino-acid aminotransferase, cytosolic
Ligand
BDBM50173927
Substrate
Meas. Tech.
ChEBML_1581369
IC50
3981±n/a nM
Citation
 Deng, HZhou, JSundersingh, FMesser, JASomers, DOAjakane, MArico-Muendel, CCBeljean, ABelyanskaya, SLBingham, RBlazensky, EBoullay, ABBoursier, EChai, JCarter, PChung, CWDaugan, ADing, YHerry, KHobbs, CHumphries, EKollmann, CNguyen, VLNicodeme, ESmith, SEDodic, NAncellin, N Discovery and Optimization of Potent, Selective, and in Vivo Efficacious 2-Aryl Benzimidazole BCATm Inhibitors. ACS Med Chem Lett 7:379-84 (2016)  
Target
Name:
Branched-chain-amino-acid aminotransferase, cytosolic
Synonyms:
BCAT1 BCT1 ECA39
Type:
PROTEIN
Mol. Mass.:
42957.10
Organism:
Homo sapiens (Human)
Description:
ChEMBL_1516919
Residue:
386
  
Inhibitor
Name:
BDBM50173927
Synonyms:
CHEMBL3808902
Type:
Small organic molecule
Emp. Form.:
C25H24BrN5O2S
Mol. Mass.:
538.459
SMILES:
CNC(=O)c1ccc2n([C@@H]3CCC[C@@H](C3)NC(=O)c3ccc(Br)s3)c(nc2c1)-c1ccccn1
: