Target
Branched-chain-amino-acid aminotransferase, mitochondrial
Ligand
BDBM50173918
Substrate
Meas. Tech.
ChEMBL_1580974 (CHEMBL3812806)
IC50
1259±n/a nM
Citation
 Deng, HZhou, JSundersingh, FMesser, JASomers, DOAjakane, MArico-Muendel, CCBeljean, ABelyanskaya, SLBingham, RBlazensky, EBoullay, ABBoursier, EChai, JCarter, PChung, CWDaugan, ADing, YHerry, KHobbs, CHumphries, EKollmann, CNguyen, VLNicodeme, ESmith, SEDodic, NAncellin, N Discovery and Optimization of Potent, Selective, and in Vivo Efficacious 2-Aryl Benzimidazole BCATm Inhibitors. ACS Med Chem Lett 7:379-84 (2016)  
Target
Name:
Branched-chain-amino-acid aminotransferase, mitochondrial
Synonyms:
BCAT(m) BCAT2_HUMAN BCATM Branched-chain-amino-acid aminotransferase, mitochondrial PP18 | Placental protein 18
Type:
PROTEIN
Mol. Mass.:
44297.81
Organism:
Homo sapiens (Human)
Description:
ChEMBL_109874
Residue:
392
  
Inhibitor
Name:
BDBM50173918
Synonyms:
CHEMBL3809916
Type:
Small organic molecule
Emp. Form.:
C25H22N6O2S
Mol. Mass.:
470.546
SMILES:
NC(=O)c1ccc2n([C@@H]3CCC[C@@H](C3)NC(=O)c3ccc(s3)C#N)c(nc2c1)-c1ccccn1
: