Target
Branched-chain-amino-acid aminotransferase, mitochondrial
Ligand
BDBM50173937
Substrate
Meas. Tech.
ChEMBL_1580973 (CHEMBL3812805)
IC50
1000±n/a nM
Citation
 Deng, HZhou, JSundersingh, FMesser, JASomers, DOAjakane, MArico-Muendel, CCBeljean, ABelyanskaya, SLBingham, RBlazensky, EBoullay, ABBoursier, EChai, JCarter, PChung, CWDaugan, ADing, YHerry, KHobbs, CHumphries, EKollmann, CNguyen, VLNicodeme, ESmith, SEDodic, NAncellin, N Discovery and Optimization of Potent, Selective, and in Vivo Efficacious 2-Aryl Benzimidazole BCATm Inhibitors. ACS Med Chem Lett 7:379-84 (2016)  
Target
Name:
Branched-chain-amino-acid aminotransferase, mitochondrial
Synonyms:
BCAT(m) BCAT2_HUMAN BCATM Branched-chain-amino-acid aminotransferase, mitochondrial PP18 | Placental protein 18
Type:
PROTEIN
Mol. Mass.:
44297.81
Organism:
Homo sapiens (Human)
Description:
ChEMBL_109874
Residue:
392
  
Inhibitor
Name:
BDBM50173937
Synonyms:
CHEMBL3809820
Type:
Small organic molecule
Emp. Form.:
C23H21BrN4OS
Mol. Mass.:
481.408
SMILES:
Brc1ccc(s1)C(=O)N[C@H]1CCC[C@H](C1)n1c(nc2ccccc12)-c1ccccn1
: