Target
Carbonic anhydrase 1
Ligand
BDBM50176460
Substrate
Meas. Tech.
ChEMBL_1579079 (CHEMBL3811427)
Ki
6.6±n/a nM
Citation
 Abdel Gawad, NMAmin, NHElsaadi, MTMohamed, FMMAngeli, ADe Luca, VCapasso, CSupuran, CT Synthesis of 4-(thiazol-2-ylamino)-benzenesulfonamides with carbonic anhydrase I, II and IX inhibitory activity and cytotoxic effects against breast cancer cell lines. Bioorg Med Chem 24:3043-3051 (2016)  
Target
Name:
Carbonic anhydrase 1
Synonyms:
CA-I CAB Carbonate dehydratase I Carbonic anhydrase 1 (CA I) Carbonic anhydrase 1 (Recombinant CA I) Carbonic anhydrase B Carbonic anhydrase I (CA I) Carbonic anhydrase I (CAI) Carbonic anhydrase isoenzyme I (hCA I) | hCA
Type:
Enzyme
Mol. Mass.:
28873.37
Organism:
Homo sapiens (Human)
Description:
P00915
Residue:
261
  
Inhibitor
Name:
BDBM50176460
Synonyms:
CHEMBL3808746
Type:
Small organic molecule
Emp. Form.:
C16H14N4O4S2
Mol. Mass.:
390.437
SMILES:
NS(=O)(=O)c1ccc(Nc2nc(Nc3ccc(cc3)C(O)=O)cs2)cc1
: