Target
Sphingosine kinase 2
Ligand
BDBM50177004
Substrate
Meas. Tech.
ChEMBL_1582605 (CHEMBL3816946)
Ki
980±n/a nM
Citation
 Congdon, MDKharel, YBrown, AMLewis, SNBevan, DRLynch, KRSantos, WL Structure-Activity Relationship Studies and Molecular Modeling of Naphthalene-Based Sphingosine Kinase 2 Inhibitors. ACS Med Chem Lett 7:229-34 (2016)  
Target
Name:
Sphingosine kinase 2
Synonyms:
SK 2 SPHK2 SPK 2 Sphingosine kinase types 2 (SphK2)
Type:
Protein
Mol. Mass.:
69221.44
Organism:
Homo sapiens (Human)
Description:
Q9NRA0
Residue:
654
  
Inhibitor
Name:
BDBM50177004
Synonyms:
CHEMBL3813833
Type:
Small organic molecule
Emp. Form.:
C22H28ClN5O2
Mol. Mass.:
429.943
SMILES:
Cl.CCCCCOc1ccc2cc(ccc2c1)-c1noc(n1)[C@@H]1CCCN1C(N)=N
: