Target
Fatty acid-binding protein, adipocyte
Ligand
BDBM50212873
Substrate
Meas. Tech.
ChEMBL_1583389 (CHEMBL3816121)
Ki
160±n/a nM
Citation
 Tagami, UTakahashi, KIgarashi, SEjima, CYoshida, TTakeshita, SMiyanaga, WSugiki, MTokumasu, MHatanaka, TKashiwagi, TIshikawa, KMiyano, HMizukoshi, T Interaction Analysis of FABP4 Inhibitors by X-ray Crystallography and Fragment Molecular Orbital Analysis. ACS Med Chem Lett 7:435-9 (2016)  
Target
Name:
Fatty acid-binding protein, adipocyte
Synonyms:
A-FABP ALBP FABP4 Fatty acid binding protein adipocyte Fatty acid-binding protein 4 (FABP4)
Type:
Enzyme
Mol. Mass.:
14719.23
Organism:
Homo sapiens (Human)
Description:
P15090
Residue:
132
  
Inhibitor
Name:
BDBM50212873
Synonyms:
((2'-(5-ETHYL-3,4-DIPHENYL-1H-PYRAZOL-1-YL)-3-BIPHENYLYL)OXY)ACETIC ACID CHEMBL247920 | [2'-(5-Ethyl-3,4-diphenyl-pyrazol-1-yl)-biphenyl-3-yloxy]-acetic acid
Type:
Small organic molecule
Emp. Form.:
C31H26N2O3
Mol. Mass.:
474.5497
SMILES:
CCc1c(c(nn1-c1ccccc1-c1cccc(OCC(O)=O)c1)-c1ccccc1)-c1ccccc1
: