Target
3-phosphoinositide-dependent protein kinase 1
Ligand
BDBM10838
Substrate
Meas. Tech.
ChEMBL_1583678 (CHEMBL3815765)
IC50
5400±n/a nM
Citation
 Wucherer-Plietker, MMerkul, EMüller, TJEsdar, CKnöchel, THeinrich, TBuchstaller, HPGreiner, HDorsch, DFinsinger, DCalderini, MBruge, DGrädler, U Discovery of novel 7-azaindoles as PDK1 inhibitors. Bioorg Med Chem Lett 26:3073-80 (2016)  
Target
Name:
3-phosphoinositide-dependent protein kinase 1
Synonyms:
3-Phosphoinositide-Dependent Protein Kinase 1 (PDK1) 3-phosphoinositide-dependent protein kinase 1 3-phosphoinositide-dependent protein kinase 1 (PDK-1) Isoform 2 of 3-phosphoinositide-dependent protein kinase 1 PDPK1 Phosphoinositide-dependent protein kinase 1 (PDK1) hPDK1
Type:
Enzyme
Mol. Mass.:
63157.65
Organism:
Homo sapiens (Human)
Description:
O15530
Residue:
556
  
Inhibitor
Name:
BDBM10838
Synonyms:
3-(2-aminopyrimidin-4-yl)-1H-indol-4-ol | Meridianin A
Type:
Small organic molecule
Emp. Form.:
C12H10N4O
Mol. Mass.:
226.234
SMILES:
Nc1nccc(n1)-c1c[nH]c2cccc(O)c12
: