Target
Serine/threonine-protein kinase TNNI3K
Ligand
BDBM50178339
Substrate
Meas. Tech.
ChEMBL_1583231 (CHEMBL3816884)
IC50
<10.0±n/a nM
Citation
 Lawhorn, BGPhilp, JGraves, APShewchuk, LHolt, DAGatto, GJKallander, LS GSK114: A selective inhibitor for elucidating the biological role of TNNI3K. Bioorg Med Chem Lett 26:3355-3358 (2016)  
Target
Name:
Serine/threonine-protein kinase TNNI3K
Synonyms:
CARK TNI3K_HUMAN | TNNI3K
Type:
Enzyme Catalytic Domain
Mol. Mass.:
92855.14
Organism:
Homo sapiens (Human)
Description:
gi_7705748
Residue:
835
  
Inhibitor
Name:
BDBM50178339
Synonyms:
CHEMBL3814923
Type:
Small organic molecule
Emp. Form.:
C24H32N6O4S
Mol. Mass.:
500.614
SMILES:
CNS(=O)(=O)c1ccc(N(C)C)c(Nc2ncnc3cc(OCCCN4CCOCC4)ccc23)c1
: