Target
Serine/threonine-protein kinase TNNI3K
Ligand
BDBM50178306
Substrate
Meas. Tech.
ChEMBL_1583231 (CHEMBL3816884)
IC50
13±n/a nM
Citation
 Lawhorn, BGPhilp, JGraves, APShewchuk, LHolt, DAGatto, GJKallander, LS GSK114: A selective inhibitor for elucidating the biological role of TNNI3K. Bioorg Med Chem Lett 26:3355-3358 (2016)  
Target
Name:
Serine/threonine-protein kinase TNNI3K
Synonyms:
CARK TNI3K_HUMAN | TNNI3K
Type:
Enzyme Catalytic Domain
Mol. Mass.:
92855.14
Organism:
Homo sapiens (Human)
Description:
gi_7705748
Residue:
835
  
Inhibitor
Name:
BDBM50178306
Synonyms:
CHEMBL3814998
Type:
Small organic molecule
Emp. Form.:
C20H21F3N4O5S
Mol. Mass.:
486.465
SMILES:
CCOc1cc2ncnc(Nc3cc(ccc3OCC(F)(F)F)S(=O)(=O)NC)c2cc1OC
: