Target
Nischarin
Ligand
BDBM50021809
Substrate
Meas. Tech.
ChEMBL_1583797 (CHEMBL3815884)
Ki
0.794328±n/a nM
Citation
 Vucicevic, JSrdic-Rajic, TPieroni, MLaurila, JMPerovic, VTassini, SAzzali, ECostantino, GGlisic, SAgbaba, DScheinin, MNikolic, KRadi, MVeljkovic, N A combined ligand- and structure-based approach for the identification of rilmenidine-derived compounds which synergize the antitumor effects of doxorubicin. Bioorg Med Chem 24:3174-83 (2016)  
Target
Name:
Nischarin
Synonyms:
Imidazoline I1 Nisch | Nischarin
Type:
Enzyme Catalytic Domain
Mol. Mass.:
166460.59
Organism:
RAT
Description:
Q4G017
Residue:
1502
  
Inhibitor
Name:
BDBM50021809
Synonyms:
(2,6-Dichloro-4-iodo-phenyl)-(4,5-dihydro-1H-imidazol-2-yl)-amine CHEMBL360803 | p-iodoclonidine
Type:
Small organic molecule
Emp. Form.:
C9H8Cl2IN3
Mol. Mass.:
355.99
SMILES:
Clc1cc(I)cc(Cl)c1\[#7]=[#6]-1\[#7]-[#6]-[#6]-[#7]-1
: