Target
Oxysterols receptor LXR-alpha
Ligand
BDBM50094851
Substrate
Meas. Tech.
ChEMBL_1583938 (CHEMBL3815370)
EC50
1120±n/a nM
Citation
 Koura, MYamaguchi, YKurobuchi, SSumida, HWatanabe, YEnomoto, TMatsuda, TOkuda, AKoshizawa, TMatsumoto, YShibuya, K Discovery of a 2-hydroxyacetophenone derivative as an outstanding linker to enhance potency andß-selectivity of liver X receptor agonist. Bioorg Med Chem 24:3436-46 (2016)  
Target
Name:
Oxysterols receptor LXR-alpha
Synonyms:
LXRA Liver X receptor alpha Liver X receptor alpha (NR1H3) NR1H3 Nuclear orphan receptor LXR-alpha | Nuclear receptor subfamily 1 group H member 3
Type:
Enzyme Catalytic Domain
Mol. Mass.:
50403.85
Organism:
Homo sapiens (Human)
Description:
Q13133
Residue:
447
  
Inhibitor
Name:
BDBM50094851
Synonyms:
CHEMBL3589803
Type:
Small organic molecule
Emp. Form.:
C32H40F6N2O5
Mol. Mass.:
646.6608
SMILES:
CCCc1cc(cc(CCC)c1OCCCCN1C(=O)NC(C)(C1=O)c1ccc(OC(C)C)cc1)C(O)(C(F)(F)F)C(F)(F)F
: