Target
Oxysterols receptor LXR-alpha
Ligand
BDBM50179431
Substrate
Meas. Tech.
ChEMBL_1583938 (CHEMBL3815370)
EC50
3740±n/a nM
Citation
 Koura, MYamaguchi, YKurobuchi, SSumida, HWatanabe, YEnomoto, TMatsuda, TOkuda, AKoshizawa, TMatsumoto, YShibuya, K Discovery of a 2-hydroxyacetophenone derivative as an outstanding linker to enhance potency andß-selectivity of liver X receptor agonist. Bioorg Med Chem 24:3436-46 (2016)  
Target
Name:
Oxysterols receptor LXR-alpha
Synonyms:
LXRA Liver X receptor alpha Liver X receptor alpha (NR1H3) NR1H3 Nuclear orphan receptor LXR-alpha | Nuclear receptor subfamily 1 group H member 3
Type:
Enzyme Catalytic Domain
Mol. Mass.:
50403.85
Organism:
Homo sapiens (Human)
Description:
Q13133
Residue:
447
  
Inhibitor
Name:
BDBM50179431
Synonyms:
CHEMBL3814351
Type:
Small organic molecule
Emp. Form.:
C34H34F6N2O7
Mol. Mass.:
696.6334
SMILES:
CCCc1cc(ccc1Oc1ccc(C(=O)CN2C(=O)NC(C)(C2=O)c2ccc(OC(C)C)cc2)c(OC)c1)C(O)(C(F)(F)F)C(F)(F)F
: