Target
Oxysterols receptor LXR-beta
Ligand
BDBM50179403
Substrate
Meas. Tech.
ChEMBL_1583942 (CHEMBL3815374)
EC50
120±n/a nM
Citation
 Koura, MYamaguchi, YKurobuchi, SSumida, HWatanabe, YEnomoto, TMatsuda, TOkuda, AKoshizawa, TMatsumoto, YShibuya, K Discovery of a 2-hydroxyacetophenone derivative as an outstanding linker to enhance potency andß-selectivity of liver X receptor agonist. Bioorg Med Chem 24:3436-46 (2016)  
Target
Name:
Oxysterols receptor LXR-beta
Synonyms:
LXRB Liver X, LXR beta NR1H2 Nuclear receptor NER Ubiquitously-expressed nuclear receptor
Type:
Enzyme Catalytic Domain
Mol. Mass.:
50978.79
Organism:
Homo sapiens (Human)
Description:
P55055
Residue:
460
  
Inhibitor
Name:
BDBM50179403
Synonyms:
CHEMBL3814381
Type:
Small organic molecule
Emp. Form.:
C33H32F6N2O6
Mol. Mass.:
666.6074
SMILES:
CCCc1cc(ccc1Oc1ccc(cc1)C(=O)CN1C(=O)NC(C)(C1=O)c1ccc(OC(C)C)cc1)C(O)(C(F)(F)F)C(F)(F)F
: