Target
Oxysterols receptor LXR-beta
Ligand
BDBM50179485
Substrate
Meas. Tech.
ChEMBL_1583942 (CHEMBL3815374)
EC50
58±n/a nM
Citation
 Koura, MYamaguchi, YKurobuchi, SSumida, HWatanabe, YEnomoto, TMatsuda, TOkuda, AKoshizawa, TMatsumoto, YShibuya, K Discovery of a 2-hydroxyacetophenone derivative as an outstanding linker to enhance potency andß-selectivity of liver X receptor agonist. Bioorg Med Chem 24:3436-46 (2016)  
Target
Name:
Oxysterols receptor LXR-beta
Synonyms:
LXRB Liver X, LXR beta NR1H2 Nuclear receptor NER Ubiquitously-expressed nuclear receptor
Type:
Enzyme Catalytic Domain
Mol. Mass.:
50978.79
Organism:
Homo sapiens (Human)
Description:
P55055
Residue:
460
  
Inhibitor
Name:
BDBM50179485
Synonyms:
CHEMBL3814799
Type:
Small organic molecule
Emp. Form.:
C32H31F6N3O7
Mol. Mass.:
683.5949
SMILES:
CCCc1cc(ccc1Oc1ccc(C(=O)CN2C(=O)NC(C)(C2=O)c2ccc(OC(C)C)cn2)c(O)c1)C(O)(C(F)(F)F)C(F)(F)F
: