Target
Epidermal growth factor receptor
Ligand
BDBM50179515
Substrate
Meas. Tech.
ChEMBL_1583975 (CHEMBL3815441)
IC50
21±n/a nM
Citation
 Mowafy, SGalanis, ADoctor, ZMParanal, RMLasheen, DSFarag, NAJänne, PAAbouzid, KA Toward discovery of mutant EGFR inhibitors; Design, synthesis and in vitro biological evaluation of potent 4-arylamino-6-ureido and thioureido-quinazoline derivatives. Bioorg Med Chem 24:3501-12 (2016)  
Target
Name:
Epidermal growth factor receptor
Synonyms:
EGF Receptor Substrate EGFR_HUMAN ERBB1 Epidermal Growth Factor Receptor erbB-1 Epidermal growth factor receptor (EGFR) HER1 Proto-oncogene c-ErbB-1 Tyrosine-Protein Kinase ErbB-1
Type:
Receptor Kinase Domain
Mol. Mass.:
134279.59
Organism:
Homo sapiens (Human)
Description:
P00533
Residue:
1210
  
Inhibitor
Name:
BDBM50179515
Synonyms:
CHEMBL3814882
Type:
Small organic molecule
Emp. Form.:
C22H25BrN6O
Mol. Mass.:
469.378
SMILES:
Brc1cccc(Nc2ncnc3ccc(NC(=O)NCCN4CCCCC4)cc23)c1
: