Target
Monocarboxylate transporter 1
Ligand
BDBM50180640
Substrate
Meas. Tech.
ChEMBL_1584864 (CHEMBL3822206)
EC50
520±n/a nM
Citation
 Nair, RNMishra, JKLi, FTortosa, MYang, CDoherty, JRCameron, MCleveland, JLRoush, WRBannister, TD Exploiting the co-reliance of tumours upon transport of amino acids and lactate: Gln and Tyr conjugates of MCT1 inhibitors. Medchemcomm 7:900-905 (2016)  
Target
Name:
Monocarboxylate transporter 1
Synonyms:
MCT 1 MOT1_HUMAN SLC16A1 | Solute carrier family 16 member 1
Type:
PROTEIN
Mol. Mass.:
53956.64
Organism:
Homo sapiens (Human)
Description:
ChEMBL_1451367
Residue:
500
  
Inhibitor
Name:
BDBM50180640
Synonyms:
CHEMBL3819278
Type:
Small organic molecule
Emp. Form.:
C25H38N6O2S
Mol. Mass.:
486.673
SMILES:
CC(C)Cc1nn(C)c(=O)c2c(SCCCO)n(Cc3ccnc(NCCCCCN)c3)cc12
: