Target
Prolyl endopeptidase
Ligand
BDBM50180667
Substrate
Meas. Tech.
ChEMBL_1584421 (CHEMBL3819964)
Ki
1500±n/a nM
Citation
 Mariaule, GDe Cesco, SAiraghi, FKurian, JSchiavini, PRocheleau, SHuskic, IAuclair, KMittermaier, AMoitessier, N 3-Oxo-hexahydro-1H-isoindole-4-carboxylic Acid as a Drug Chiral Bicyclic Scaffold: Structure-Based Design and Preparation of Conformationally Constrained Covalent and Noncovalent Prolyl Oligopeptidase Inhibitors. J Med Chem 59:4221-34 (2016)  
Target
Name:
Prolyl endopeptidase
Synonyms:
PE POP PREP Prolyl oligopeptidase
Type:
Enzyme
Mol. Mass.:
80688.50
Organism:
Homo sapiens (Human)
Description:
P48147
Residue:
710
  
Inhibitor
Name:
BDBM50180667
Synonyms:
CHEMBL3818815
Type:
Small organic molecule
Emp. Form.:
C22H24N4O4
Mol. Mass.:
408.4504
SMILES:
[H][C@]12CN(NC(=O)OCc3ccccc3)C(=O)[C@]1([H])[C@@H](CC=C2)C(=O)N1CCC[C@H]1C#N
: