Target
Prolyl endopeptidase
Ligand
BDBM50180672
Substrate
Meas. Tech.
ChEMBL_1584421 (CHEMBL3819964)
Ki
67000±n/a nM
Citation
 Mariaule, GDe Cesco, SAiraghi, FKurian, JSchiavini, PRocheleau, SHuskic, IAuclair, KMittermaier, AMoitessier, N 3-Oxo-hexahydro-1H-isoindole-4-carboxylic Acid as a Drug Chiral Bicyclic Scaffold: Structure-Based Design and Preparation of Conformationally Constrained Covalent and Noncovalent Prolyl Oligopeptidase Inhibitors. J Med Chem 59:4221-34 (2016)  
Target
Name:
Prolyl endopeptidase
Synonyms:
PE POP PREP Prolyl oligopeptidase
Type:
Enzyme
Mol. Mass.:
80688.50
Organism:
Homo sapiens (Human)
Description:
P48147
Residue:
710
  
Inhibitor
Name:
BDBM50180672
Synonyms:
CHEMBL3818541
Type:
Small organic molecule
Emp. Form.:
C22H27N3O4
Mol. Mass.:
397.4675
SMILES:
[H][C@]12CN(NC(=O)OCc3ccccc3)C(=O)[C@]1([H])[C@@H]([C@@H](C)C=C2)C(=O)N1CCCC1
: