Target
Prolyl endopeptidase
Ligand
BDBM50312223
Substrate
Meas. Tech.
ChEMBL_1584430 (CHEMBL3819973)
IC50
2000±n/a nM
Citation
 Mariaule, GDe Cesco, SAiraghi, FKurian, JSchiavini, PRocheleau, SHuskic, IAuclair, KMittermaier, AMoitessier, N 3-Oxo-hexahydro-1H-isoindole-4-carboxylic Acid as a Drug Chiral Bicyclic Scaffold: Structure-Based Design and Preparation of Conformationally Constrained Covalent and Noncovalent Prolyl Oligopeptidase Inhibitors. J Med Chem 59:4221-34 (2016)  
Target
Name:
Prolyl endopeptidase
Synonyms:
PE POP PREP Prolyl oligopeptidase
Type:
Enzyme
Mol. Mass.:
80688.50
Organism:
Homo sapiens (Human)
Description:
P48147
Residue:
710
  
Inhibitor
Name:
BDBM50312223
Synonyms:
(2R,5S,7R)-1-Aza-7-benzyloxycarbonylamino-8-oxo-4-thiabicyclo[3.3.0]octane-2-carbonitrile | CHEMBL1079474
Type:
Small organic molecule
Emp. Form.:
C15H15N3O3S
Mol. Mass.:
317.363
SMILES:
O=C(N[C@@H]1C[C@@H]2SC[C@@H](C#N)N2C1=O)OCc1ccccc1
: