Target
Prolyl endopeptidase
Ligand
BDBM50393843
Substrate
Meas. Tech.
ChEMBL_1584421 (CHEMBL3819964)
Ki
23±n/a nM
Citation
 Mariaule, GDe Cesco, SAiraghi, FKurian, JSchiavini, PRocheleau, SHuskic, IAuclair, KMittermaier, AMoitessier, N 3-Oxo-hexahydro-1H-isoindole-4-carboxylic Acid as a Drug Chiral Bicyclic Scaffold: Structure-Based Design and Preparation of Conformationally Constrained Covalent and Noncovalent Prolyl Oligopeptidase Inhibitors. J Med Chem 59:4221-34 (2016)  
Target
Name:
Prolyl endopeptidase
Synonyms:
PE POP PREP Prolyl oligopeptidase
Type:
Enzyme
Mol. Mass.:
80688.50
Organism:
Homo sapiens (Human)
Description:
P48147
Residue:
710
  
Inhibitor
Name:
BDBM50393843
Synonyms:
CHEMBL2159748
Type:
Small organic molecule
Emp. Form.:
C21H19N3O2
Mol. Mass.:
345.3945
SMILES:
O=C(N1CCC[C@H]1C#N)c1cccc2CN(Cc3ccccc3)C(=O)c12
: