Target
D(4) dopamine receptor
Ligand
BDBM50130293
Substrate
Meas. Tech.
ChEBML_1586515
Ki
510±n/a nM
Citation
 Ofori, EZhu, XYEtukala, JRPeprah, KJordan, KRAdkins, AABricker, BAKang, HJHuang, XPRoth, BLAblordeppey, SY Design and synthesis of dual 5-HT1A and 5-HT7 receptor ligands. Bioorg Med Chem 24:3464-71 (2016)  
Target
Name:
D(4) dopamine receptor
Synonyms:
D(4) dopamine receptor DOPAMINE D4.4 Dopamine receptor | Drd4
Type:
Enzyme Catalytic Domain
Mol. Mass.:
41307.65
Organism:
RAT
Description:
DOPAMINE D4.4 0 RAT::P30729
Residue:
387
  
Inhibitor
Name:
BDBM50130293
Synonyms:
7-{4-[4-(2,3-dichlorophenyl)piperazin-1-yl]butoxy}-3,4-dihydroquinolin-2(1H)-one CHEMBL1112 US10752588, Compound Aripiprazole US9018213, aripprazole | US9156822, Aripiprazole
Type:
Small organic molecule
Emp. Form.:
C23H27Cl2N3O2
Mol. Mass.:
448.385
SMILES:
Clc1cccc(N2CCN(CCCCOc3ccc4CCC(=O)Nc4c3)CC2)c1Cl
: