Target
5-hydroxytryptamine receptor 7
Ligand
BDBM50182745
Substrate
Meas. Tech.
ChEMBL_1586510 (CHEMBL3821449)
Ki
27±n/a nM
Citation
 Ofori, EZhu, XYEtukala, JRPeprah, KJordan, KRAdkins, AABricker, BAKang, HJHuang, XPRoth, BLAblordeppey, SY Design and synthesis of dual 5-HT1A and 5-HT7 receptor ligands. Bioorg Med Chem 24:3464-71 (2016)  
Target
Name:
5-hydroxytryptamine receptor 7
Synonyms:
5-HT-7 5-HT7 5-HT7S 5HT7 HTR7 | Serotonin receptor 7
Type:
G Protein-Coupled Receptor (GPCR)
Mol. Mass.:
53573.08
Organism:
Homo sapiens (Human)
Description:
P34969
Residue:
479
  
Inhibitor
Name:
BDBM50182745
Synonyms:
CHEMBL3818128
Type:
Small organic molecule
Emp. Form.:
C19H23ClFN
Mol. Mass.:
319.844
SMILES:
Cl.Fc1ccc(CCCCN2CCc3ccccc3C2)cc1
: