Target
Bromodomain-containing protein 9
Ligand
BDBM50183566
Substrate
Meas. Tech.
ChEMBL_1586798 (CHEMBL3826483)
IC50
9338±n/a nM
Citation
 Martin, LJKoegl, MBader, GCockcroft, XLFedorov, OFiegen, DGerstberger, THofmann, MHHohmann, AFKessler, DKnapp, SKnesl, PKornigg, SMüller, SNar, HRogers, CRumpel, KSchaaf, OSteurer, STallant, CVakoc, CRZeeb, MZoephel, APearson, MBoehmelt, GMcConnell, D Structure-Based Design of an in Vivo Active Selective BRD9 Inhibitor. J Med Chem 59:4462-75 (2016)  
Target
Name:
Bromodomain-containing protein 9
Synonyms:
BRD9 Bromodomain-containing protein 9 | Rhabdomyosarcoma antigen MU-RMS-40.8
Type:
PROTEIN
Mol. Mass.:
66994.30
Organism:
Homo sapiens (Human)
Description:
ChEMBL_108000
Residue:
597
  
Inhibitor
Name:
BDBM50183566
Synonyms:
CHEMBL3822498
Type:
Small organic molecule
Emp. Form.:
C14H14N2O2
Mol. Mass.:
242.2732
SMILES:
Cc1cc(cn(C)c1=O)-c1ccc(cc1)C(N)=O
: