Target
Delta-type opioid receptor
Ligand
BDBM50185316
Substrate
Meas. Tech.
ChEMBL_1587711 (CHEMBL3825891)
EC50
270±n/a nM
Citation
 Harland, AABender, AMGriggs, NWGao, CAnand, JPPogozheva, IDTraynor, JRJutkiewicz, EMMosberg, HI Effects of N-Substitutions on the Tetrahydroquinoline (THQ) Core of Mixed-Efficacyµ-Opioid Receptor (MOR)/d-Opioid Receptor (DOR) Ligands. J Med Chem 59:4985-98 (2016)  
Target
Name:
Delta-type opioid receptor
Synonyms:
Cytochrome P450 3A4 Delta opioid receptor Delta-type opioid receptor (DOR) OPRD_RAT Opioid receptor Opioid receptors; mu & delta Ror-a | Voltage-gated potassium channel
Type:
G Protein-Coupled Receptor (GPCR)
Mol. Mass.:
40465.04
Organism:
Rattus norvegicus (rat)
Description:
Competition binding assays were using CHO-K1 cell membranes expressing the opioid receptor.
Residue:
372
  
Inhibitor
Name:
BDBM50185316
Synonyms:
CHEMBL3824309
Type:
Small organic molecule
Emp. Form.:
C29H34N4O3
Mol. Mass.:
486.6053
SMILES:
Cc1cc(O)cc(C)c1C[C@H](N)C(=O)N[C@@H]1CCN(CC(N)=O)c2ccc(Cc3ccccc3)cc12
: