Target
Adenosine receptor A3
Ligand
BDBM50187597
Substrate
Meas. Tech.
ChEMBL_1590515 (CHEMBL3831097)
Ki
>1000±n/a nM
Citation
 Szymanska, EDrabczynska, AKarcz, TMüller, CEKöse, MKarolak-Wojciechowska, JFruzinski, ASchabikowski, JDoroz-Plonka, AHandzlik, JKiec-Kononowicz, K Similarities and differences in affinity and binding modes of tricyclic pyrimido- and pyrazinoxanthines at human and rat adenosine receptors. Bioorg Med Chem 24:4347-4362 (2016)  
Target
Name:
Adenosine receptor A3
Synonyms:
A3 adenosine receptor (hA3) ADORA3 | Adenosine A3 receptor (A3AR)
Type:
G Protein-Coupled Receptor (GPCR)
Mol. Mass.:
36197.32
Organism:
Homo sapiens (Human)
Description:
P0DMS8
Residue:
318
  
Inhibitor
Name:
BDBM50187597
Synonyms:
CHEMBL3828530
Type:
Small organic molecule
Emp. Form.:
C20H26N6O3
Mol. Mass.:
398.4588
SMILES:
CN(C)CCOc1ccc(cc1)N1CCCn2c1nc1n(C)c(=O)n(C)c(=O)c21
: