Target
Adenosine receptor A2a
Ligand
BDBM50187588
Substrate
Meas. Tech.
ChEMBL_1590503 (CHEMBL3831085)
Ki
1480±n/a nM
Citation
 Szymanska, EDrabczynska, AKarcz, TMüller, CEKöse, MKarolak-Wojciechowska, JFruzinski, ASchabikowski, JDoroz-Plonka, AHandzlik, JKiec-Kononowicz, K Similarities and differences in affinity and binding modes of tricyclic pyrimido- and pyrazinoxanthines at human and rat adenosine receptors. Bioorg Med Chem 24:4347-4362 (2016)  
Target
Name:
Adenosine receptor A2a
Synonyms:
AA2AR_RAT Adenosine A2 receptor Adenosine Receptors A2a (A2a) Adenosine receptors A2a Rat striatal adenosine A2a receptor
Type:
G Protein-Coupled Receptor (GPCR)
Mol. Mass.:
45015.65
Organism:
Rattus norvegicus (rat)
Description:
Rat A2A receptors expressed in CHO cells.
Residue:
410
  
Inhibitor
Name:
BDBM50187588
Synonyms:
CHEMBL3827201
Type:
Small organic molecule
Emp. Form.:
C29H42N6O3
Mol. Mass.:
522.6822
SMILES:
CCCCn1c2nc3N(CCCn3c2c(=O)n(CCCC)c1=O)c1ccc(OCCN2CCCCC2)cc1
: