Target
Aromatase
Ligand
BDBM9475
Substrate
Meas. Tech.
ChEMBL_1589887 (CHEMBL3830767)
IC50
51±n/a nM
Citation
 Dandriyal, JSingla, RKumar, MJaitak, V Recent developments of C-4 substituted coumarin derivatives as anticancer agents. Eur J Med Chem 119:141-68 (2016)  
Target
Name:
Aromatase
Synonyms:
ARO1 CP19A_HUMAN CYP19 CYPXIX Cytochrome P450 19A1 Cytochrome P450-C19 (CYP19) FL cytokine receptor precursor | P-450AROM
Type:
Enzyme
Mol. Mass.:
57888.92
Organism:
Homo sapiens (Human)
Description:
P11511
Residue:
503
  
Inhibitor
Name:
BDBM9475
Synonyms:
4-(1H-Imidazol-1-ylmethyl)-7-phenoxy-2H-chromen-2-one Coumarin deriv. 24
Type:
Small organic molecule
Emp. Form.:
C19H14N2O3
Mol. Mass.:
318.3261
SMILES:
O=c1cc(Cn2ccnc2)c2ccc(Oc3ccccc3)cc2o1
: