Target
Toll-like receptor 7
Ligand
BDBM50189181
Substrate
Meas. Tech.
ChEMBL_1591133 (CHEMBL3829203)
EC50
190±n/a nM
Citation
 Cortez, ALi, YMiller, ATZhang, XYue, KMaginnis, JHampton, JHall, de SShapiro, MNayak, BD'Oro, ULi, CSkibinski, DMbow, MLSingh, MO'Hagan, DTCooke, MPValiante, NMWu, TY Incorporation of Phosphonate into Benzonaphthyridine Toll-like Receptor 7 Agonists for Adsorption to Aluminum Hydroxide. J Med Chem 59:5868-78 (2016)  
Target
Name:
Toll-like receptor 7
Synonyms:
TLR7_MOUSE | Tlr7
Type:
PROTEIN
Mol. Mass.:
121844.65
Organism:
Mus musculus
Description:
ChEMBL_933765
Residue:
1050
  
Inhibitor
Name:
BDBM50189181
Synonyms:
CHEMBL3828229 | US9597326, Compound 21
Type:
Small organic molecule
Emp. Form.:
C30H36N3O8P
Mol. Mass.:
597.5959
SMILES:
Cc1cc(OCCOCCOCCP(O)(O)=O)ccc1CCc1cnc2c(N)nc3cc(CCC(O)=O)ccc3c2c1
: