Target
Peregrin
Ligand
BDBM50189339
Substrate
Meas. Tech.
ChEMBL_1589340 (CHEMBL3830584)
IC50
100±n/a nM
Citation
 Bamborough, PBarnett, HABecher, IBird, MJChung, CWCraggs, PDDemont, EHDiallo, HFallon, DJGordon, LJGrandi, PHobbs, CIHooper-Greenhill, EJones, EJLaw, RPLe Gall, ALugo, DMichon, AMMitchell, DJPrinjha, RKSheppard, RJWatson, AJWatson, RJ GSK6853, a Chemical Probe for Inhibition of the BRPF1 Bromodomain. ACS Med Chem Lett 7:552-7 (2016)  
Target
Name:
Peregrin
Synonyms:
BR140 BRPF1_HUMAN Peregrin | Protein Br140
Type:
PROTEIN
Mol. Mass.:
137524.47
Organism:
Homo sapiens (Human)
Description:
ChEMBL_108054
Residue:
1214
  
Inhibitor
Name:
BDBM50189339
Synonyms:
CHEMBL3828500
Type:
Small organic molecule
Emp. Form.:
C22H27N3O5
Mol. Mass.:
413.4669
SMILES:
COCCOc1ccccc1C(=O)Nc1cc2n(C)c(=O)n(C)c2cc1OC(C)C
: