Target
Peregrin
Ligand
BDBM50189341
Substrate
Meas. Tech.
ChEMBL_1589340 (CHEMBL3830584)
IC50
316±n/a nM
Citation
 Bamborough, PBarnett, HABecher, IBird, MJChung, CWCraggs, PDDemont, EHDiallo, HFallon, DJGordon, LJGrandi, PHobbs, CIHooper-Greenhill, EJones, EJLaw, RPLe Gall, ALugo, DMichon, AMMitchell, DJPrinjha, RKSheppard, RJWatson, AJWatson, RJ GSK6853, a Chemical Probe for Inhibition of the BRPF1 Bromodomain. ACS Med Chem Lett 7:552-7 (2016)  
Target
Name:
Peregrin
Synonyms:
BR140 BRPF1_HUMAN Peregrin | Protein Br140
Type:
PROTEIN
Mol. Mass.:
137524.47
Organism:
Homo sapiens (Human)
Description:
ChEMBL_108054
Residue:
1214
  
Inhibitor
Name:
BDBM50189341
Synonyms:
CHEMBL3827750
Type:
Small organic molecule
Emp. Form.:
C24H30N4O4
Mol. Mass.:
438.5194
SMILES:
CC(C)Oc1cc2n(C)c(=O)n(C)c2cc1NC(=O)c1ccccc1OC1CCN(C)C1
: