Target
Cyclin-dependent kinase 8
Ligand
BDBM50189414
Substrate
Meas. Tech.
ChEMBL_1589660 (CHEMBL3829689)
IC50
4.6±n/a nM
Citation
 Mallinger, ASchiemann, KRink, CSejberg, JHoney, MACzodrowski, PStubbs, MPoeschke, OBusch, MSchneider, RSchwarz, DMusil, DBurke, RUrbahns, KWorkman, PWienke, DClarke, PARaynaud, FIEccles, SAEsdar, CRohdich, FBlagg, J 2,8-Disubstituted-1,6-Naphthyridines and 4,6-Disubstituted-Isoquinolines with Potent, Selective Affinity for CDK8/19. ACS Med Chem Lett 7:573-8 (2016)  
Target
Name:
Cyclin-dependent kinase 8
Synonyms:
CDK8 Cell division protein kinase 8 Mediator complex subunit CDK8 Protein kinase K35
Type:
Serine/threonine-protein kinase
Mol. Mass.:
53300.21
Organism:
Homo sapiens (Human)
Description:
P49336
Residue:
464
  
Inhibitor
Name:
BDBM50189414
Synonyms:
CHEMBL3828209
Type:
Small organic molecule
Emp. Form.:
C18H15N5O
Mol. Mass.:
317.3446
SMILES:
CNC(=O)c1ccc2cncc(-c3ccc4cnn(C)c4c3)c2n1
: