Target
Chromobox protein homolog 7
Ligand
BDBM50189780
Substrate
Meas. Tech.
ChEMBL_1590133 (CHEMBL3829401)
Kd
125300±n/a nM
Citation
 Ren, CSmith, SGYap, KLi, SLi, JMezei, MRodriguez, YVincek, AAguilo, FWalsh, MJZhou, MM Structure-Guided Discovery of Selective Antagonists for the Chromodomain of Polycomb Repressive Protein CBX7. ACS Med Chem Lett 7:601-5 (2016)  
Target
Name:
Chromobox protein homolog 7
Synonyms:
CBX7 Chromobox protein homolog 7 | Chromobox protein homolog 7 (CBX7)
Type:
Protein
Mol. Mass.:
28351.76
Organism:
Homo sapiens (Human)
Description:
Residue:
251
  
Inhibitor
Name:
BDBM50189780
Synonyms:
CHEMBL3827954
Type:
Small organic molecule
Emp. Form.:
C22H26N2O5
Mol. Mass.:
398.4522
SMILES:
COc1cccc(C(=O)N2CCN(CC2)C(=O)COc2cccc(C)c2)c1OC
: