Target
Extracellular calcium-sensing receptor
Ligand
BDBM50190167
Substrate
Meas. Tech.
ChEMBL_1589193 (CHEMBL3829966)
IC50
>10000±n/a nM
Citation
 Liang, GBZhou, CHuo, XWang, HYang, XHuang, SWang, HWilkinson, HLuo, LTang, WSutton, DLi, HZaller, DMeinke, PT Discovery of novel dihydrobenzofuran cyclopropane carboxylic acid based calcium sensing receptor antagonists for the treatment of osteoporosis. Bioorg Med Chem Lett 26:4077-80 (2016)  
Target
Name:
Extracellular calcium-sensing receptor
Synonyms:
CASR CaR Calcium-sensing receptor (CaSR) GPRC2A Parathyroid Cell calcium-sensing receptor Synonyms=GPRC2A | hCasR
Type:
Protein
Mol. Mass.:
120663.13
Organism:
Homo sapiens (Human)
Description:
P41180
Residue:
1078
  
Inhibitor
Name:
BDBM50190167
Synonyms:
CHEMBL3827898
Type:
Small organic molecule
Emp. Form.:
C28H35NO7S
Mol. Mass.:
529.645
SMILES:
[H][C@]12Oc3c(c(ccc3C)[C@@H](C)OC[C@H](O)CNC(C)(C)Cc3ccc4c(CCS4(=O)=O)c3)[C@@]1([H])[C@@H]2C(O)=O
: