Target
Proliferating cell nuclear antigen
Ligand
BDBM50431467
Substrate
Meas. Tech.
ChEMBL_1612848 (CHEMBL3854648)
IC50
1000±n/a nM
Citation
 Korzhnev, DMHadden, MK Targeting the Translesion Synthesis Pathway for the Development of Anti-Cancer Chemotherapeutics. J Med Chem 59:9321-9336 (2016)  
Target
Name:
Proliferating cell nuclear antigen
Synonyms:
Cyclin PCNA_HUMAN
Type:
PROTEIN
Mol. Mass.:
28752.86
Organism:
Homo sapiens (Human)
Description:
ChEMBL_952429
Residue:
261
  
Inhibitor
Name:
BDBM50431467
Synonyms:
CHEMBL2348305
Type:
Small organic molecule
Emp. Form.:
C15H15I2NO3
Mol. Mass.:
511.0934
SMILES:
N[C@H](CO)Cc1cc(I)c(Oc2ccc(O)cc2)c(I)c1
: