Target
Cyclin-dependent kinase 8
Ligand
BDBM50191414
Substrate
Meas. Tech.
ChEMBL_1613002 (CHEMBL3854802)
IC50
2.8±n/a nM
Citation
 Czodrowski, PMallinger, AWienke, DEsdar, CPöschke, OBusch, MRohdich, FEccles, SAOrtiz-Ruiz, MJSchneider, RRaynaud, FIClarke, PAMusil, DSchwarz, DDale, TUrbahns, KBlagg, JSchiemann, K Structure-Based Optimization of Potent, Selective, and Orally Bioavailable CDK8 Inhibitors Discovered by High-Throughput Screening. J Med Chem 59:9337-9349 (2016)  
Target
Name:
Cyclin-dependent kinase 8
Synonyms:
CDK8 Cell division protein kinase 8 Mediator complex subunit CDK8 Protein kinase K35
Type:
Serine/threonine-protein kinase
Mol. Mass.:
53300.21
Organism:
Homo sapiens (Human)
Description:
P49336
Residue:
464
  
Inhibitor
Name:
BDBM50191414
Synonyms:
CHEMBL3947140
Type:
Small organic molecule
Emp. Form.:
C18H17ClN4O
Mol. Mass.:
340.807
SMILES:
Cc1n[nH]c2ccc(nc12)C(=O)N1CCC[C@H]1c1ccc(Cl)cc1
: